Target
Thyrotropin-releasing hormone receptor
Ligand
BDBM50072394
Substrate
Meas. Tech.
ChEMBL_1508580 (CHEMBL3602663)
IC50
7.0±n/a nM
Citation
 Meena, CLThakur, ANandekar, PPSangamwar, ATSharma, SSJain, R Synthesis of CNS active thyrotropin-releasing hormone (TRH)-like peptides: Biological evaluation and effect on cognitive impairment induced by cerebral ischemia in mice. Bioorg Med Chem 23:5641-53 (2015)  
Target
Name:
Thyrotropin-releasing hormone receptor
Synonyms:
TRH-R2 | Thyrotropin-releasing hormone receptor 2
Type:
PROTEIN
Mol. Mass.:
27545.04
Organism:
Mus musculus
Description:
ChEMBL_109850
Residue:
251
  
Inhibitor
Name:
BDBM50072394
Synonyms:
1-[3-(1H-4-imidazolyl)-2-(5-oxotetrahydro-1H-2-pyrrolylcarboxamido)propanoyl]tetrahydro-1H-2-pyrrolecarboxamide ABBOTT-38579 | PROTIRELIN
Type:
Small organic molecule
Emp. Form.:
C16H22N6O4
Mol. Mass.:
362.3837
SMILES:
NC(=O)[C@@H]1CCCN1C(=O)[C@H](Cc1cnc[nH]1)NC(=O)[C@@H]1CCC(=O)N1
: