Target
Oligo-1,6-glucosidase IMA1
Ligand
BDBM50113278
Substrate
Meas. Tech.
ChEMBL_1508808 (CHEMBL3603280)
IC50
91300±n/a nM
Citation
 Zhao, XRHuo, XKDong, PPWang, CHuang, SSZhang, BJZhang, HLDeng, SLiu, KXMa, XC Inhibitory Effects of Highly Oxygenated Lanostane Derivatives from the Fungus Ganoderma lucidum on P-Glycoprotein anda-Glucosidase. J Nat Prod 78:1868-76 (2015)  
Target
Name:
Oligo-1,6-glucosidase IMA1
Synonyms:
α-glucosidase Alpha-glucosidase (α-glucosidase) MALX3_YEAST | Oligo-1,6-glucosidase
Type:
Protein
Mol. Mass.:
68577.59
Organism:
Saccharomyces cerevisiae S288c (Baker's yeast)
Description:
Residue:
589
  
Inhibitor
Name:
BDBM50113278
Synonyms:
CHEMBL3601514
Type:
Small organic molecule
Emp. Form.:
C27H36O7
Mol. Mass.:
472.5705
SMILES:
[H][C@@]1(CC(=O)[C@@]2(C)C3=C(C(=O)C(=O)[C@]12C)[C@@]1(C)CC[C@H](O)C(C)(C)[C@]1([H])C[C@@H]3O)[C@]1(C)CCC(=O)O1
: