Target
Neuronal acetylcholine receptor subunit alpha-7
Ligand
BDBM50114005
Substrate
Meas. Tech.
ChEMBL_1510986 (CHEMBL3607039)
Ki
212±n/a nM
Citation
 Bolchi, CValoti, EGotti, CFasoli, FRuggeri, PFumagalli, LBinda, MMucchietto, VSciaccaluga, MBudriesi, RFucile, SPallavicini, M Chemistry and Pharmacology of a Series of Unichiral Analogues of 2-(2-Pyrrolidinyl)-1,4-benzodioxane, Prolinol Phenyl Ether, and Prolinol 3-Pyridyl Ether Designed asa4ß2-Nicotinic Acetylcholine Receptor Agonists. J Med Chem 58:6665-77 (2015)  
Target
Name:
Neuronal acetylcholine receptor subunit alpha-7
Synonyms:
ACHA7_RAT Cholinergic, Nicotinic Alpha7 Chrna7 Neuronal acetylcholine receptor (alpha7 nAChR) Neuronal acetylcholine receptor subunit alpha-7 Neuronal acetylcholine receptor subunit alpha-7 (nAChR)
Type:
Enzyme
Mol. Mass.:
56502.44
Organism:
Rattus norvegicus (Rat)
Description:
Q05941
Residue:
502
  
Inhibitor
Name:
BDBM50114005
Synonyms:
CHEMBL3603930
Type:
Small organic molecule
Emp. Form.:
C11H15NO2
Mol. Mass.:
193.2423
SMILES:
Oc1cccc(OC[C@@H]2CCCN2)c1
: