Target
Pancreatic triacylglycerol lipase
Ligand
BDBM7462
Substrate
Meas. Tech.
ChEMBL_1512589 (CHEMBL3610636)
IC50
>100000±n/a nM
Citation
 Jo, YHKim, SBLiu, QLee, JWHwang, BYLee, MK Benzylated and prenylated flavonoids from the root barks of Cudrania tricuspidata with pancreatic lipase inhibitory activity. Bioorg Med Chem Lett 25:3455-7 (2015)  
Target
Name:
Pancreatic triacylglycerol lipase
Synonyms:
LIPP_PIG PNLIP Pancreatic lipase | Pancreatic triacylglycerol lipase
Type:
Enzyme
Mol. Mass.:
50080.69
Organism:
Sus scrofa (Pig)
Description:
P00591
Residue:
450
  
Inhibitor
Name:
BDBM7462
Synonyms:
3,5,7-trihydroxy-2-(4-hydroxyphenyl)-4H-chromen-4-one CHEMBL150 Kaempferol (Kmp) kaempferol
Type:
Small organic molecule
Emp. Form.:
C15H10O6
Mol. Mass.:
286.2363
SMILES:
Oc1ccc(cc1)-c1oc2cc(O)cc(O)c2c(=O)c1O
: