Target
S-methyl-5'-thioadenosine phosphorylase
Ligand
BDBM50116357
Substrate
Meas. Tech.
ChEMBL_1511510 (CHEMBL3606935)
Ki
750±n/a nM
Citation
 Evans, GBCameron, SALuxenburger, AGuan, RSuarez, JThomas, KSchramm, VLTyler, PC Tight binding enantiomers of pre-clinical drug candidates. Bioorg Med Chem 23:5326-33 (2015)  
Target
Name:
S-methyl-5'-thioadenosine phosphorylase
Synonyms:
5'-Methylthioadenosine phosphorylase (MTAP) MTA phosphorylase MTAP_HUMAN Methylthioadenosine Phosphorylase (MTAP) | S-methyl-5 -thioadenosine phosphorylase
Type:
Enzyme
Mol. Mass.:
31239.23
Organism:
Homo sapiens (Human)
Description:
Residue:
283
  
Inhibitor
Name:
BDBM50116357
Synonyms:
CHEMBL3604360
Type:
Small organic molecule
Emp. Form.:
C13H19N5OS
Mol. Mass.:
293.388
SMILES:
CSC[C@@H]1CN(Cc2c[nH]c3c(N)ncnc23)C[C@H]1O
: