Target
Amine oxidase [flavin-containing] A
Ligand
BDBM50117996
Substrate
Meas. Tech.
ChEMBL_1514157 (CHEMBL3614600)
IC50
>100000±n/a nM
Citation
 Choi, JWJang, BKCho, NCPark, JHYeon, SKJu, EJLee, YSHan, GPae, ANKim, DJPark, KD Synthesis of a series of unsaturated ketone derivatives as selective and reversible monoamine oxidase inhibitors. Bioorg Med Chem 23:6486-96 (2015)  
Target
Name:
Amine oxidase [flavin-containing] A
Synonyms:
AOFA_HUMAN MAO-A Monoamine oxidase Monoamine oxidase type A (MAO A) Monoamine oxidase type A (MAOA)
Type:
Protein
Mol. Mass.:
59689.53
Organism:
Homo sapiens (Human)
Description:
P21397
Residue:
527
  
Inhibitor
Name:
BDBM50117996
Synonyms:
CHEMBL3613264
Type:
Small organic molecule
Emp. Form.:
C16H12F3NO
Mol. Mass.:
291.2678
SMILES:
FC(F)(F)c1ccccc1\C=C\C(=O)Nc1ccccc1
: