Target
Cyclin-T1/Cyclin-dependent kinase 9
Ligand
BDBM50118370
Substrate
Meas. Tech.
ChEMBL_1514892 (CHEMBL3615643)
IC50
79±n/a nM
Citation
 Phillipson, LJSegal, DHNero, TLParker, MWWan, SSde Silva, MGuthridge, MAWei, AHBurns, CJ Discovery and SAR of novel pyrazolo[1,5-a]pyrimidines as inhibitors of CDK9. Bioorg Med Chem 23:6280-96 (2015)  
Target
Name:
Cyclin-T1/Cyclin-dependent kinase 9
Synonyms:
CDK9/ Cyclin-T1 CDK9/Cyclin T Cyclin T1/dependent kinase 9 | Cyclin-Dependent Kinase 9 (CDK9)
Type:
Protein Complex
Mol. Mass.:
Description:
Components:
This complex has 2 components.
Component 1
Name:
Cyclin-T1
Synonyms:
CCNT1 CycT Cyclin T Cyclin-T
Type:
Enzyme Subunit
Mol. Mass.:
80712.40
Organism:
Homo sapiens (Human)
Description:
Residue:
726
  
Component 2
Name:
Cyclin-dependent kinase 9
Synonyms:
C-2K CDK9 Cell division cycle 2-like protein kinase 4 Cyclin-Dependent Kinase 9 (CDK9) Serine/threonine-protein kinase PITALRE Tat-associated kinase complex catalytic subunit
Type:
Enzyme Subunit
Mol. Mass.:
42789.13
Organism:
Homo sapiens (Human)
Description:
Residue:
372
  
Inhibitor
Name:
BDBM50118370
Synonyms:
CHEMBL3612501
Type:
Small organic molecule
Emp. Form.:
C14H10Cl2N6O4S
Mol. Mass.:
429.238
SMILES:
CN(\N=C\c1cnn2ccc(Cl)nc12)S(=O)(=O)c1cc(ccc1Cl)[N+]([O-])=O
: