Target
Cyclin-dependent kinase 7
Ligand
BDBM50118346
Substrate
Meas. Tech.
ChEMBL_1514893 (CHEMBL3615644)
IC50
841±n/a nM
Citation
 Phillipson, LJSegal, DHNero, TLParker, MWWan, SSde Silva, MGuthridge, MAWei, AHBurns, CJ Discovery and SAR of novel pyrazolo[1,5-a]pyrimidines as inhibitors of CDK9. Bioorg Med Chem 23:6280-96 (2015)  
Target
Name:
Cyclin-dependent kinase 7
Synonyms:
39 kDa protein kinase CAK1 CDK-activating kinase 1 (CAK) CDK7_HUMAN Cell division protein kinase 7 Cyclin-dependent kinase 7 (CDK7/cyclin H) P39 Mo15 TFIIH basal transcription factor complex kinase subunit
Type:
Enzyme Subunit
Mol. Mass.:
39047.01
Organism:
Homo sapiens (Human)
Description:
Residue:
346
  
Inhibitor
Name:
BDBM50118346
Synonyms:
CHEMBL3612482
Type:
Small organic molecule
Emp. Form.:
C15H13ClN6O4S
Mol. Mass.:
408.82
SMILES:
CN(\N=C\c1cnn2ccc(Cl)nc12)S(=O)(=O)c1cc(ccc1C)[N+]([O-])=O
: