Target
Receptor-type tyrosine-protein kinase FLT3
Ligand
BDBM50118344
Substrate
Meas. Tech.
ChEMBL_1514895 (CHEMBL3615646)
IC50
0.177000±n/a nM
Citation
 Phillipson, LJSegal, DHNero, TLParker, MWWan, SSde Silva, MGuthridge, MAWei, AHBurns, CJ Discovery and SAR of novel pyrazolo[1,5-a]pyrimidines as inhibitors of CDK9. Bioorg Med Chem 23:6280-96 (2015)  
Target
Name:
Receptor-type tyrosine-protein kinase FLT3
Synonyms:
CD135 FL cytokine receptor FLK2 FLT3 Fetal liver kinase-2 Fms-like tyrosine kinase 3 (Flt-3) STK-1 Stem cell tyrosine kinase 1
Type:
Enzyme
Mol. Mass.:
112888.62
Organism:
Homo sapiens (Human)
Description:
P36888
Residue:
993
  
Inhibitor
Name:
BDBM50118344
Synonyms:
CHEMBL3612513
Type:
Small organic molecule
Emp. Form.:
C17H16ClN5O2S
Mol. Mass.:
389.859
SMILES:
CN(CCc1cnn2ccc(Cl)nc12)S(=O)(=O)c1cc(ccc1C)C#N
: