Target
D(2) dopamine receptor
Ligand
BDBM50119500
Substrate
Meas. Tech.
ChEMBL_1515737 (CHEMBL3614290)
Ki
2.5±n/a nM
Citation
 Möller, DSalama, IKling, RCHübner, HGmeiner, P 1,4-Disubstituted aromatic piperazines with high 5-HT2A/D2 selectivity: Quantitative structure-selectivity investigations, docking, synthesis and biological evaluation. Bioorg Med Chem 23:6195-209 (2015)  
Target
Name:
D(2) dopamine receptor
Synonyms:
D(2) dopamine receptor DOPAMINE D2 Long DRD2 Dopamine D2 receptor Dopamine D2 receptor (D2R) Dopamine2-like | d2
Type:
Cell-surface receptors
Mol. Mass.:
50647.10
Organism:
Homo sapiens (Human)
Description:
P14416
Residue:
443
  
Inhibitor
Name:
BDBM50119500
Synonyms:
CHEMBL221587
Type:
Small organic molecule
Emp. Form.:
C27H36N6O2
Mol. Mass.:
476.6137
SMILES:
COc1ccccc1N1CCN(CCCCCNC(=O)c2nnn(Cc3ccccc3)c2C)CC1
: