Target
Carbonic anhydrase 1
Ligand
BDBM26981
Substrate
Meas. Tech.
ChEMBL_1521734 (CHEMBL3626557)
Ki
300000±n/a nM
Citation
 Mahon, BPDíaz-Torres, NAPinard, MATu, CSilverman, DNScott, KMMcKenna, R Activity and anion inhibition studies of thea-carbonic anhydrase from Thiomicrospira crunogena XCL-2 Gammaproteobacterium. Bioorg Med Chem Lett 25:4937-40 (2015)  
Target
Name:
Carbonic anhydrase 1
Synonyms:
CA-I CAB Carbonate dehydratase I Carbonic anhydrase 1 (CA I) Carbonic anhydrase 1 (Recombinant CA I) Carbonic anhydrase B Carbonic anhydrase I (CA I) Carbonic anhydrase I (CAI) Carbonic anhydrase isoenzyme I (hCA I) | hCA
Type:
Enzyme
Mol. Mass.:
28873.37
Organism:
Homo sapiens (Human)
Description:
P00915
Residue:
261
  
Inhibitor
Name:
BDBM26981
Synonyms:
CHEMBL1644695 POTASSIUM IODIDE iodide ion
Type:
Ion
Emp. Form.:
I
Mol. Mass.:
126.90502
SMILES:
[I-]
: