Target
Tyrosine-protein kinase JAK2
Ligand
BDBM50121209
Substrate
Meas. Tech.
ChEMBL_1521760 (CHEMBL3626583)
IC50
2451±n/a nM
Citation
 Zhan, PItoh, YSuzuki, TLiu, X Strategies for the Discovery of Target-Specific or Isoform-Selective Modulators. J Med Chem 58:7611-33 (2015)  
Target
Name:
Tyrosine-protein kinase JAK2
Synonyms:
JAK-2 JAK2_HUMAN Janus kinase 2 (JAK2) | Janus kinase 2 (a protein tyrosine kinase)
Type:
Protein
Mol. Mass.:
130684.68
Organism:
Homo sapiens (Human)
Description:
O60674
Residue:
1132
  
Inhibitor
Name:
BDBM50121209
Synonyms:
CHEMBL3622376
Type:
Small organic molecule
Emp. Form.:
C11H10N6O
Mol. Mass.:
242.2367
SMILES:
C(C1CO1)n1cc(nn1)-c1ncnc2[nH]ccc12
: