Target
Histone deacetylase 5
Ligand
BDBM50121211
Substrate
Meas. Tech.
ChEMBL_1521764 (CHEMBL3626587)
IC50
>100000±n/a nM
Citation
 Zhan, PItoh, YSuzuki, TLiu, X Strategies for the Discovery of Target-Specific or Isoform-Selective Modulators. J Med Chem 58:7611-33 (2015)  
Target
Name:
Histone deacetylase 5
Synonyms:
Antigen NY-CO-9 HDAC5 Histone acetylase 5 (HDAC5) Human HDAC5 | KIAA0600
Type:
Enzyme
Mol. Mass.:
121968.61
Organism:
Homo sapiens (Human)
Description:
Q9UQL6
Residue:
1122
  
Inhibitor
Name:
BDBM50121211
Synonyms:
CHEMBL3622375
Type:
Small organic molecule
Emp. Form.:
C21H18N6O3S
Mol. Mass.:
434.471
SMILES:
Nc1ccccc1NC(=O)c1ccc(s1)-c1cn(CCc2cccc(c2)[N+]([O-])=O)nn1
: