Target
Histone deacetylase 3
Ligand
BDBM50121211
Substrate
Meas. Tech.
ChEMBL_1521754 (CHEMBL3626577)
IC50
260±n/a nM
Citation
 Zhan, PItoh, YSuzuki, TLiu, X Strategies for the Discovery of Target-Specific or Isoform-Selective Modulators. J Med Chem 58:7611-33 (2015)  
Target
Name:
Histone deacetylase 3
Synonyms:
HD3 HDAC3_HUMAN Human HDAC3 SMAP45
Type:
Enzyme
Mol. Mass.:
48829.55
Organism:
Homo sapiens (Human)
Description:
O15379
Residue:
428
  
Inhibitor
Name:
BDBM50121211
Synonyms:
CHEMBL3622375
Type:
Small organic molecule
Emp. Form.:
C21H18N6O3S
Mol. Mass.:
434.471
SMILES:
Nc1ccccc1NC(=O)c1ccc(s1)-c1cn(CCc2cccc(c2)[N+]([O-])=O)nn1
: