Target
Histone deacetylase 1
Ligand
BDBM50121211
Substrate
Meas. Tech.
ChEMBL_1521753 (CHEMBL3626576)
IC50
>100000±n/a nM
Citation
 Zhan, PItoh, YSuzuki, TLiu, X Strategies for the Discovery of Target-Specific or Isoform-Selective Modulators. J Med Chem 58:7611-33 (2015)  
Target
Name:
Histone deacetylase 1
Synonyms:
Cereblon/Histone deacetylase 1 HDAC1 Histone deacetylase 1 (HDAC1) RPD3L1
Type:
Enzyme
Mol. Mass.:
55090.27
Organism:
Homo sapiens (Human)
Description:
Q13547
Residue:
482
  
Inhibitor
Name:
BDBM50121211
Synonyms:
CHEMBL3622375
Type:
Small organic molecule
Emp. Form.:
C21H18N6O3S
Mol. Mass.:
434.471
SMILES:
Nc1ccccc1NC(=O)c1ccc(s1)-c1cn(CCc2cccc(c2)[N+]([O-])=O)nn1
: