Target
Histone deacetylase 4
Ligand
BDBM50121210
Substrate
Meas. Tech.
ChEMBL_1521756 (CHEMBL3626579)
IC50
>100000±n/a nM
Citation
 Zhan, PItoh, YSuzuki, TLiu, X Strategies for the Discovery of Target-Specific or Isoform-Selective Modulators. J Med Chem 58:7611-33 (2015)  
Target
Name:
Histone deacetylase 4
Synonyms:
Cereblon/Histone deacetylase 4 HDAC4 Histone acetylase 4(HDAC4) KIAA0288
Type:
Enzyme
Mol. Mass.:
119049.39
Organism:
Homo sapiens (Human)
Description:
P56524
Residue:
1084
  
Inhibitor
Name:
BDBM50121210
Synonyms:
CHEMBL3622374
Type:
Small organic molecule
Emp. Form.:
C21H19N5OS
Mol. Mass.:
389.473
SMILES:
Nc1ccccc1NC(=O)c1ccc(cc1)-c1cn(CCc2ccsc2)nn1
: