Target
Histone deacetylase 8
Ligand
BDBM50121210
Substrate
Meas. Tech.
ChEMBL_1521755 (CHEMBL3626578)
IC50
>100000±n/a nM
Citation
 Zhan, PItoh, YSuzuki, TLiu, X Strategies for the Discovery of Target-Specific or Isoform-Selective Modulators. J Med Chem 58:7611-33 (2015)  
Target
Name:
Histone deacetylase 8
Synonyms:
HD8 HDAC8_HUMAN Histone deacetylase 8 (HDAC-8) | Human HDAC8
Type:
Enzyme
Mol. Mass.:
41749.60
Organism:
Homo sapiens (Human)
Description:
Q9BY41
Residue:
377
  
Inhibitor
Name:
BDBM50121210
Synonyms:
CHEMBL3622374
Type:
Small organic molecule
Emp. Form.:
C21H19N5OS
Mol. Mass.:
389.473
SMILES:
Nc1ccccc1NC(=O)c1ccc(cc1)-c1cn(CCc2ccsc2)nn1
: