Target
Histone deacetylase 3
Ligand
BDBM50121210
Substrate
Meas. Tech.
ChEMBL_1521754 (CHEMBL3626577)
IC50
240±n/a nM
Citation
 Zhan, PItoh, YSuzuki, TLiu, X Strategies for the Discovery of Target-Specific or Isoform-Selective Modulators. J Med Chem 58:7611-33 (2015)  
Target
Name:
Histone deacetylase 3
Synonyms:
HD3 HDAC3_HUMAN Human HDAC3 SMAP45
Type:
Enzyme
Mol. Mass.:
48829.55
Organism:
Homo sapiens (Human)
Description:
O15379
Residue:
428
  
Inhibitor
Name:
BDBM50121210
Synonyms:
CHEMBL3622374
Type:
Small organic molecule
Emp. Form.:
C21H19N5OS
Mol. Mass.:
389.473
SMILES:
Nc1ccccc1NC(=O)c1ccc(cc1)-c1cn(CCc2ccsc2)nn1
: