Target
Serine/threonine-protein kinase mTOR
Ligand
BDBM50121212
Substrate
Meas. Tech.
ChEMBL_1521769 (CHEMBL3626592)
IC50
>10000±n/a nM
Citation
 Zhan, PItoh, YSuzuki, TLiu, X Strategies for the Discovery of Target-Specific or Isoform-Selective Modulators. J Med Chem 58:7611-33 (2015)  
Target
Name:
Serine/threonine-protein kinase mTOR
Synonyms:
FK506-binding protein 12-rapamycin complex-associated protein 1 FRAP FRAP1 MTOR Mammalian Target of Rapamycin (mTOR) RAFT1 Rapamycin and FKBP12 target 1 Serine/threonine-protein kinase (mTOR) | mTORC2
Type:
Rapamycin target protein
Mol. Mass.:
288917.12
Organism:
Homo sapiens (Human)
Description:
P42345
Residue:
2549
  
Inhibitor
Name:
BDBM50121212
Synonyms:
CHEMBL3622372
Type:
Small organic molecule
Emp. Form.:
C19H21ClF3N5O2
Mol. Mass.:
443.851
SMILES:
C[C@@H]1COCCN1c1cc(=O)n2CC[C@H](N(Cc3cncc(Cl)c3)c2n1)C(F)(F)F
: