Target
Lysine-specific histone demethylase 1A
Ligand
BDBM50121213
Substrate
Meas. Tech.
ChEMBL_1521763 (CHEMBL3626586)
IC50
300±n/a nM
Citation
 Zhan, PItoh, YSuzuki, TLiu, X Strategies for the Discovery of Target-Specific or Isoform-Selective Modulators. J Med Chem 58:7611-33 (2015)  
Target
Name:
Lysine-specific histone demethylase 1A
Synonyms:
AOF2 Flavin-containing amine oxidase domain-containing protein 2 KDM1A KIAA0601 Lysine-specific demethylase 1 (LSD1) Lysine-specific histone demethylase 1 (LSD1)
Type:
Enzyme
Mol. Mass.:
92901.01
Organism:
Homo sapiens (Human)
Description:
O60341
Residue:
852
  
Inhibitor
Name:
BDBM50121213
Synonyms:
CHEMBL3622371
Type:
Small organic molecule
Emp. Form.:
C29H33N3O2
Mol. Mass.:
455.5912
SMILES:
O=C(NCc1ccccc1)[C@H](CCCCNC1CC1c1ccccc1)NC(=O)c1ccccc1
: