Target
Amine oxidase [flavin-containing] A
Ligand
BDBM50121213
Substrate
Meas. Tech.
ChEMBL_1521747 (CHEMBL3626570)
IC50
>25000±n/a nM
Citation
 Zhan, PItoh, YSuzuki, TLiu, X Strategies for the Discovery of Target-Specific or Isoform-Selective Modulators. J Med Chem 58:7611-33 (2015)  
Target
Name:
Amine oxidase [flavin-containing] A
Synonyms:
AOFA_HUMAN MAO-A Monoamine oxidase Monoamine oxidase type A (MAO A) Monoamine oxidase type A (MAOA)
Type:
Protein
Mol. Mass.:
59689.53
Organism:
Homo sapiens (Human)
Description:
P21397
Residue:
527
  
Inhibitor
Name:
BDBM50121213
Synonyms:
CHEMBL3622371
Type:
Small organic molecule
Emp. Form.:
C29H33N3O2
Mol. Mass.:
455.5912
SMILES:
O=C(NCc1ccccc1)[C@H](CCCCNC1CC1c1ccccc1)NC(=O)c1ccccc1
: