Target
Amine oxidase [flavin-containing] B
Ligand
BDBM50346862
Substrate
Meas. Tech.
ChEMBL_1521746 (CHEMBL3626569)
IC50
>1000000±n/a nM
Citation
 Zhan, PItoh, YSuzuki, TLiu, X Strategies for the Discovery of Target-Specific or Isoform-Selective Modulators. J Med Chem 58:7611-33 (2015)  
Target
Name:
Amine oxidase [flavin-containing] B
Synonyms:
AOFB_HUMAN MAOB Monoamine oxidase type B (MAO B) Monoamine oxidase type B (MAOB)
Type:
Protein
Mol. Mass.:
58768.76
Organism:
Homo sapiens (Human)
Description:
P27338
Residue:
520
  
Inhibitor
Name:
BDBM50346862
Synonyms:
CHEMBL1215658
Type:
Small organic molecule
Emp. Form.:
C27H29N3O3
Mol. Mass.:
443.5375
SMILES:
N[C@@H]1C[C@H]1c1ccc(OCC[C@H](NC(=O)c2ccccc2)C(=O)NCc2ccccc2)cc1
: