Target
Amine oxidase [flavin-containing] A
Ligand
BDBM50445336
Substrate
Meas. Tech.
ChEMBL_1521745 (CHEMBL3626568)
IC50
230000±n/a nM
Citation
 Zhan, PItoh, YSuzuki, TLiu, X Strategies for the Discovery of Target-Specific or Isoform-Selective Modulators. J Med Chem 58:7611-33 (2015)  
Target
Name:
Amine oxidase [flavin-containing] A
Synonyms:
AOFA_HUMAN MAO-A Monoamine oxidase Monoamine oxidase type A (MAO A) Monoamine oxidase type A (MAOA)
Type:
Protein
Mol. Mass.:
59689.53
Organism:
Homo sapiens (Human)
Description:
P21397
Residue:
527
  
Inhibitor
Name:
BDBM50445336
Synonyms:
CHEMBL1797639
Type:
Small organic molecule
Emp. Form.:
C27H29N3O3
Mol. Mass.:
443.5375
SMILES:
NC1CC1c1cccc(OCC[C@H](NC(=O)c2ccccc2)C(=O)NCc2ccccc2)c1
: