Target
Interleukin-1 receptor-associated kinase 4
Ligand
BDBM203526
Substrate
Meas. Tech.
ChEMBL_1520143 (CHEMBL3625715)
IC50
4200±n/a nM
Citation
 Seganish, WMFischmann, TOSherborne, BMatasi, JLavey, BMcElroy, WTTulshian, DTata, JSondey, CGarlisi, CGDevito, KFossetta, JLundell, DNiu, X Discovery and Structure Enabled Synthesis of 2,6-Diaminopyrimidin-4-one IRAK4 Inhibitors. ACS Med Chem Lett 6:942-7 (2015)  
Target
Name:
Interleukin-1 receptor-associated kinase 4
Synonyms:
IRAK-4 IRAK4_HUMAN Interleukin-1 receptor-associated kinase 4 (IRAK4) | Renal carcinoma antigen NY-REN-64
Type:
Protein
Mol. Mass.:
51519.08
Organism:
Homo sapiens (Human)
Description:
Q9NWZ3
Residue:
460
  
Inhibitor
Name:
BDBM203526
Synonyms:
US9221809, 83
Type:
Small organic molecule
Emp. Form.:
C20H24N6O2S
Mol. Mass.:
412.509
SMILES:
O=c1[nH]c(nc(N[C@@H]2CCCNC2)c1-c1nc2ccccc2s1)N1CCOCC1
: