Target
Aromatase
Ligand
BDBM50035204
Substrate
Meas. Tech.
ChEMBL_1520469 (CHEMBL3624598)
IC50
30.0±n/a nM
Citation
 Ahmad, IShagufta, na Recent developments in steroidal and nonsteroidal aromatase inhibitors for the chemoprevention of estrogen-dependent breast cancer. Eur J Med Chem 102:375-86 (2015)  
Target
Name:
Aromatase
Synonyms:
ARO1 CP19A_HUMAN CYP19 CYPXIX Cytochrome P450 19A1 Cytochrome P450-C19 (CYP19) FL cytokine receptor precursor | P-450AROM
Type:
Enzyme
Mol. Mass.:
57888.92
Organism:
Homo sapiens (Human)
Description:
P11511
Residue:
503
  
Inhibitor
Name:
BDBM50035204
Synonyms:
4-(6-Methoxy-1a,2,3,7b-tetrahydro-1H-cyclopropa[a]naphthalen-1-yl)-pyridine CHEMBL294361
Type:
Small organic molecule
Emp. Form.:
C17H17NO
Mol. Mass.:
251.323
SMILES:
COc1ccc2CCC3C(C3c2c1)c1ccncc1
: