Target
Tyrosine-protein kinase SYK
Ligand
BDBM50400047
Substrate
Meas. Tech.
ChEMBL_1521568 (CHEMBL3627446)
IC50
952±n/a nM
Citation
 Thoma, GVeenstra, SStrang, RBlanz, JVangrevelinghe, EBerghausen, JLee, CCZerwes, HG Orally bioavailable Syk inhibitors with activity in a rat PK/PD model. Bioorg Med Chem Lett 25:4642-7 (2015)  
Target
Name:
Tyrosine-protein kinase SYK
Synonyms:
KSYK_HUMAN Spleen Tyrosine Kinase Tyrosine-protein kinase SYK (Syk)
Type:
Enzyme
Mol. Mass.:
72079.99
Organism:
Homo sapiens (Human)
Description:
P43405
Residue:
635
  
Inhibitor
Name:
BDBM50400047
Synonyms:
BIIB-057 US9579320, Example 87
Type:
Small organic molecule
Emp. Form.:
C19H23N9O
Mol. Mass.:
393.4456
SMILES:
N[C@H]1CCCC[C@H]1Nc1ncc(C(N)=O)c(Nc2cccc(c2)-n2nccn2)n1
: