Target
Histone deacetylase 7
Ligand
BDBM50322422
Substrate
Meas. Tech.
ChEMBL_1522027 (CHEMBL3627134)
IC50
>10000±n/a nM
Citation
 Yao, YTu, ZLiao, CWang, ZLi, SYao, HLi, ZJiang, S Discovery of Novel Class I Histone Deacetylase Inhibitors with Promising in Vitro and in Vivo Antitumor Activities. J Med Chem 58:7672-80 (2015)  
Target
Name:
Histone deacetylase 7
Synonyms:
HD7 HDAC7A Histone acetylase 7 (HDAC7) Human HDAC7
Type:
Chromatin regulator; hydrolase; repressor
Mol. Mass.:
102942.62
Organism:
Homo sapiens (Human)
Description:
Q8WUI4
Residue:
952
  
Inhibitor
Name:
BDBM50322422
Synonyms:
CHEMBL1173445 | Largazole
Type:
Small organic molecule
Emp. Form.:
C29H42N4O5S3
Mol. Mass.:
622.863
SMILES:
CCCCCCCC(=O)SCC\C=C\[C@@H]1CC(=O)NCc2nc(cs2)C2=N[C@@](C)(CS2)C(=O)N[C@@H](C(C)C)C(=O)O1
: