Target
Cytochrome P450 11B2, mitochondrial
Ligand
BDBM191899
Substrate
Meas. Tech.
ChEMBL_1518962 (CHEMBL3626114)
IC50
28±n/a nM
Citation
 Martin, REAebi, JDHornsperger, BKrebs, HJKuhn, BKuglstatter, AAlker, AMMärki, HPMüller, SBurger, DOttaviani, GRiboulet, WVerry, PTan, XAmrein, KMayweg, AV Discovery of 4-Aryl-5,6,7,8-tetrahydroisoquinolines as Potent, Selective, and Orally Active Aldosterone Synthase (CYP11B2) Inhibitors: In Vivo Evaluation in Rodents and Cynomolgus Monkeys. J Med Chem 58:8054-65 (2015)  
Target
Name:
Cytochrome P450 11B2, mitochondrial
Synonyms:
Aldosterone Synthase (CYP11B2) Aldosterone-synthesizing enzyme CYP11B2 Cytochrome P450 11B2 Cytochrome P450 11B2, mitochondrial P-450C18 | Steroid 18-hydroxylase
Type:
Protein
Mol. Mass.:
57582.15
Organism:
Homo sapiens (Human)
Description:
P19099
Residue:
503
  
Inhibitor
Name:
BDBM191899
Synonyms:
US9187429, 30 US9187429, 32
Type:
Small organic molecule
Emp. Form.:
C18H18ClFN2O
Mol. Mass.:
332.8
SMILES:
CCC(=O)NC1CCCc2c1cncc2-c1ccc(Cl)cc1F
: