Target
Cytochrome P450 11B2, mitochondrial
Ligand
BDBM50125049
Substrate
Meas. Tech.
ChEMBL_1518969 (CHEMBL3626121)
IC50
530±n/a nM
Citation
 Martin, REAebi, JDHornsperger, BKrebs, HJKuhn, BKuglstatter, AAlker, AMMärki, HPMüller, SBurger, DOttaviani, GRiboulet, WVerry, PTan, XAmrein, KMayweg, AV Discovery of 4-Aryl-5,6,7,8-tetrahydroisoquinolines as Potent, Selective, and Orally Active Aldosterone Synthase (CYP11B2) Inhibitors: In Vivo Evaluation in Rodents and Cynomolgus Monkeys. J Med Chem 58:8054-65 (2015)  
Target
Name:
Cytochrome P450 11B2, mitochondrial
Synonyms:
Aldosterone synthase CYPXIB2 Cyp11b2 Cytochrome P450C11 | Steroid 11-beta-hydroxylase
Type:
PROTEIN
Mol. Mass.:
57397.51
Organism:
Mus musculus
Description:
ChEMBL_109884
Residue:
500
  
Inhibitor
Name:
BDBM50125049
Synonyms:
CHEMBL3623830
Type:
Small organic molecule
Emp. Form.:
C19H19N3O
Mol. Mass.:
305.3737
SMILES:
CCC(=O)N[C@@H]1CCCc2c1cncc2-c1ccc(cc1)C#N
: