Target
3-phosphoinositide-dependent protein kinase 1
Ligand
BDBM50125813
Substrate
Meas. Tech.
ChEMBL_1519596 (CHEMBL3626032)
Kd
>200000±n/a nM
Citation
 Rettenmaier, TJFan, HKarpiak, JDoak, ASali, AShoichet, BKWells, JA Small-Molecule Allosteric Modulators of the Protein Kinase PDK1 from Structure-Based Docking. J Med Chem 58:8285-91 (2015)  
Target
Name:
3-phosphoinositide-dependent protein kinase 1
Synonyms:
3-Phosphoinositide-Dependent Protein Kinase 1 (PDK1) 3-phosphoinositide-dependent protein kinase 1 3-phosphoinositide-dependent protein kinase 1 (PDK-1) Isoform 2 of 3-phosphoinositide-dependent protein kinase 1 PDPK1 Phosphoinositide-dependent protein kinase 1 (PDK1) hPDK1
Type:
Enzyme
Mol. Mass.:
63157.65
Organism:
Homo sapiens (Human)
Description:
O15530
Residue:
556
  
Inhibitor
Name:
BDBM50125813
Synonyms:
CHEMBL1310463
Type:
Small organic molecule
Emp. Form.:
C17H15FN2O3S
Mol. Mass.:
346.376
SMILES:
OC(=O)Cn1c(SCCOc2ccccc2F)nc2ccccc12
: