Target
Protein-serine O-palmitoleoyltransferase porcupine
Ligand
BDBM50125895
Substrate
Meas. Tech.
ChEMBL_1519628 (CHEMBL3626166)
IC50
>1000±n/a nM
Citation
 Dong, YLi, KXu, ZMa, HZheng, JHu, ZHe, SWu, YSun, ZLuo, LLi, JZhang, HZhang, X Exploration of the linkage elements of porcupine antagonists led to potent Wnt signaling pathway inhibitors. Bioorg Med Chem 23:6855-68 (2015)  
Target
Name:
Protein-serine O-palmitoleoyltransferase porcupine
Synonyms:
MG61 PORC PORCN_HUMAN Probable protein-cysteine N-palmitoyltransferase porcupine Protein-serine O-palmitoleoyltransferase porcupine
Type:
PROTEIN
Mol. Mass.:
52337.13
Organism:
Homo sapiens (Human)
Description:
ChEMBL_103574
Residue:
461
  
Inhibitor
Name:
BDBM50125895
Synonyms:
CHEMBL3623883
Type:
Small organic molecule
Emp. Form.:
C19H16N6O2
Mol. Mass.:
360.3693
SMILES:
Cn1ncc2cc(OCC(=O)Nc3ccc(cn3)-c3cnccn3)ccc12
: