Target
Platelet-derived growth factor receptor beta
Ligand
BDBM26028
Substrate
Meas. Tech.
ChEMBL_1526219 (CHEMBL3636904)
IC50
10.0±n/a nM
Citation
 Williams, TESubramanian, SVerhagen, JMcBride, CMCostales, ASung, LAntonios-McCrea, WMcKenna, MLouie, AKRamurthy, SLevine, BShafer, CMMachajewski, TRenhowe, PAAppleton, BAAmiri, PChou, JStuart, DAardalen, KPoon, D Discovery of RAF265: A Potent mut-B-RAF Inhibitor for the Treatment of Metastatic Melanoma. ACS Med Chem Lett 6:961-5 (2015)  
Target
Name:
Platelet-derived growth factor receptor beta
Synonyms:
Beta-type platelet-derived growth factor receptor CD140b antigen PDGF Receptor Substrate PDGFR PDGFR-1 PDGFRB PGFRB_HUMAN Platelet-derived growth factor receptor 1 Platelet-derived growth factor receptor beta (PDGFR-beta) Platelet-derived growth factor receptor beta (PDGFRbeta) | VHL/PDGFRB
Type:
Enzyme
Mol. Mass.:
123922.25
Organism:
Homo sapiens (Human)
Description:
P09619
Residue:
1106
  
Inhibitor
Name:
BDBM26028
Synonyms:
4-({2-[(3-tert-butylphenyl)(methyl)amino]-1H-1,3-benzodiazol-5-yl}oxy)-N-methylpyridine-2-carboxamide | arylaminobenzimidazole, 23
Type:
Small organic molecule
Emp. Form.:
C25H27N5O2
Mol. Mass.:
429.5142
SMILES:
CNC(=O)c1cc(Oc2ccc3n(C)c(Nc4cccc(c4)C(C)(C)C)nc3c2)ccn1
: