Target
Proteinase-activated receptor 1
Ligand
BDBM50079751
Substrate
Meas. Tech.
ChEMBL_1539065 (CHEMBL3738281)
IC50
56±n/a nM
Citation
 Chao, BLi, BXXiao, X The chemistry and pharmacology of privileged pyrroloquinazolines. Medchemcomm 6:510-520 (2015)  
Target
Name:
Proteinase-activated receptor 1
Synonyms:
CF2R F2R PAR1 Proteinase activated receptor 1 TR Thrombin receptor/ Proteinase-activated receptor 1(Par-1)
Type:
Protein
Mol. Mass.:
47450.07
Organism:
Homo sapiens (Human)
Description:
P25116
Residue:
425
  
Inhibitor
Name:
BDBM50079751
Synonyms:
CHEMBL63426 | N*3*-Cyclopropyl-7-(4-isopropyl-benzyl)-7H-pyrrolo[3,2-f]quinazoline-1,3-diamine
Type:
Small organic molecule
Emp. Form.:
C23H25N5
Mol. Mass.:
371.4781
SMILES:
CC(C)c1ccc(Cn2ccc3c2ccc2nc(NC4CC4)nc(N)c32)cc1
: