Target
Xanthine dehydrogenase/oxidase
Ligand
BDBM50016784
Substrate
Meas. Tech.
ChEMBL_1545141 (CHEMBL3750495)
Ki
1550±n/a nM
Citation
 Rodrigues, MVBarbosa, AFda Silva, JFdos Santos, DAVanzolini, KLde Moraes, MCCorrêa, AGCass, QB 9-Benzoyl 9-deazaguanines as potent xanthine oxidase inhibitors. Bioorg Med Chem 24:226-31 (2016)  
Target
Name:
Xanthine dehydrogenase/oxidase
Synonyms:
XD XDHA XO Xanthine dehydrogenase/oxidase | Xanthine oxidase
Type:
Enzyme
Mol. Mass.:
146441.21
Organism:
Homo sapiens (Human)
Description:
P47989
Residue:
1333
  
Inhibitor
Name:
BDBM50016784
Synonyms:
ALLOPURINOL BW-56158 Lopurin US9428466, Allopurinol | Zyloprim
Type:
Small organic molecule
Emp. Form.:
C5H4N4O
Mol. Mass.:
136.1115
SMILES:
O=c1ncnc2[nH][nH]cc12
: