Target
Poly [ADP-ribose] polymerase tankyrase-1
Ligand
BDBM50136755
Substrate
Meas. Tech.
ChEMBL_1548570 (CHEMBL3757227)
IC50
562±n/a nM
Citation
 Haikarainen, TWaaler, JIgnatev, ANkizinkiko, YVenkannagari, HObaji, EKrauss, SLehtiö, L Development and structural analysis of adenosine site binding tankyrase inhibitors. Bioorg Med Chem Lett 26:328-33 (2016)  
Target
Name:
Poly [ADP-ribose] polymerase tankyrase-1
Synonyms:
(ARTD5 or PARP5a) PARPL Poly [ADP-ribose] polymerase tankyrase-1 TINF1 TNKS1 Tankyrase 1 Tankyrase-1 Tankyrase-1 (TNKS1)
Type:
Enzyme
Mol. Mass.:
142058.03
Organism:
Homo sapiens (Human)
Description:
O95271
Residue:
1327
  
Inhibitor
Name:
BDBM50136755
Synonyms:
CHEMBL3752386
Type:
Small organic molecule
Emp. Form.:
C25H25ClN2O5
Mol. Mass.:
468.929
SMILES:
COc1ccc(cc1)C1(CNC(=O)c2ccc(NC(=O)c3ccco3)cc2Cl)CCOCC1
: