Target
Poly [ADP-ribose] polymerase tankyrase-2
Ligand
BDBM50136757
Substrate
Meas. Tech.
ChEMBL_1548571 (CHEMBL3757228)
IC50
257±n/a nM
Citation
 Haikarainen, TWaaler, JIgnatev, ANkizinkiko, YVenkannagari, HObaji, EKrauss, SLehtiö, L Development and structural analysis of adenosine site binding tankyrase inhibitors. Bioorg Med Chem Lett 26:328-33 (2016)  
Target
Name:
Poly [ADP-ribose] polymerase tankyrase-2
Synonyms:
(ARTD6 or PARP5b) Poly [ADP-ribose] polymerase tankyrase-2 TNKL TNKS2_HUMAN Tankyrase 2 Tankyrase-2 Tankyrase-2 (TNKS2)
Type:
Enzyme
Mol. Mass.:
126937.16
Organism:
Homo sapiens (Human)
Description:
Q9H2K2
Residue:
1166
  
Inhibitor
Name:
BDBM50136757
Synonyms:
CHEMBL3753510
Type:
Small organic molecule
Emp. Form.:
C28H29ClN2O5
Mol. Mass.:
508.993
SMILES:
COc1ccc(cc1)C(=O)Nc1ccc(C(=O)NCC2(CCOCC2)c2ccc(OC)cc2)c(Cl)c1
: