Target
Histamine H1 receptor
Ligand
BDBM50140056
Substrate
Meas. Tech.
ChEMBL_1550151 (CHEMBL3756492)
Ki
676±n/a nM
Citation
 Cozzi, NVDaley, PF Receptor binding profiles and quantitative structure-affinity relationships of some 5-substituted-N,N-diallyltryptamines. Bioorg Med Chem Lett 26:959-64 (2016)  
Target
Name:
Histamine H1 receptor
Synonyms:
H1R HISTAMINE H1 HRH1_HUMAN
Type:
G Protein-Coupled Receptor (GPCR)
Mol. Mass.:
55808.72
Organism:
Homo sapiens (Human)
Description:
Cell pellets from SK-N-MC cells transfected with human H1 receptor were used in binding assay.
Residue:
487
  
Inhibitor
Name:
BDBM50140056
Synonyms:
CHEMBL3753318
Type:
Small organic molecule
Emp. Form.:
C17H22N2
Mol. Mass.:
254.37
SMILES:
Cc1ccc2[nH]cc(CCN(CC=C)CC=C)c2c1
: