Target
Alpha-2A adrenergic receptor
Ligand
BDBM50140056
Substrate
Meas. Tech.
ChEMBL_1550146 (CHEMBL3756288)
Ki
<10000±n/a nM
Citation
 Cozzi, NVDaley, PF Receptor binding profiles and quantitative structure-affinity relationships of some 5-substituted-N,N-diallyltryptamines. Bioorg Med Chem Lett 26:959-64 (2016)  
Target
Name:
Alpha-2A adrenergic receptor
Synonyms:
ADA2A_HUMAN ADRA2R Adrenergic alpha2A Alpha-2 adrenergic receptor subtype C10 Alpha-2A adrenoreceptor alpha-2A adrenergic receptor [Homo sapiens]
Type:
Enzyme
Mol. Mass.:
48979.91
Organism:
Homo sapiens (Human)
Description:
P08913
Residue:
465
  
Inhibitor
Name:
BDBM50140056
Synonyms:
CHEMBL3753318
Type:
Small organic molecule
Emp. Form.:
C17H22N2
Mol. Mass.:
254.37
SMILES:
Cc1ccc2[nH]cc(CCN(CC=C)CC=C)c2c1
: