Target
5-hydroxytryptamine receptor 2B
Ligand
BDBM50140056
Substrate
Meas. Tech.
ChEMBL_1550138 (CHEMBL3756280)
Ki
<10000±n/a nM
Citation
 Cozzi, NVDaley, PF Receptor binding profiles and quantitative structure-affinity relationships of some 5-substituted-N,N-diallyltryptamines. Bioorg Med Chem Lett 26:959-64 (2016)  
Target
Name:
5-hydroxytryptamine receptor 2B
Synonyms:
5-HT-2B 5-hydroxytryptamine (serotonin) receptor 2B [Homo sapiens] 5-hydroxytryptamine receptor 2C (5HT2C) HTR2B Serotonin 2b (5-HT2b) receptor | Serotonin Receptor 2B
Type:
G Protein-Coupled Receptor (GPCR)
Mol. Mass.:
54312.47
Organism:
Homo sapiens (Human)
Description:
Receptor binding assays were performed using human clone stably expressed in CHO cells.
Residue:
481
  
Inhibitor
Name:
BDBM50140056
Synonyms:
CHEMBL3753318
Type:
Small organic molecule
Emp. Form.:
C17H22N2
Mol. Mass.:
254.37
SMILES:
Cc1ccc2[nH]cc(CCN(CC=C)CC=C)c2c1
: