Target
Neutral amino acid transporter B(0)
Ligand
BDBM50140133
Substrate
Meas. Tech.
ChEMBL_1547440 (CHEMBL3757559)
IC50
11900±n/a nM
Citation
 Schulte, MLKhodadadi, ABCuthbertson, MLSmith, JAManning, HC 2-Amino-4-bis(aryloxybenzyl)aminobutanoic acids: A novel scaffold for inhibition of ASCT2-mediated glutamine transport. Bioorg Med Chem Lett 26:1044-7 (2016)  
Target
Name:
Neutral amino acid transporter B(0)
Synonyms:
AAAT_HUMAN ASCT2 Baboon M7 virus receptor Neutral amino acid transporter B(0) RDR SLC1A5 Solute carrier family 1 member 5
Type:
PROTEIN
Mol. Mass.:
56592.12
Organism:
Homo sapiens (Human)
Description:
ChEMBL_109758
Residue:
541
  
Inhibitor
Name:
BDBM50140133
Synonyms:
CHEMBL3753592
Type:
Small organic molecule
Emp. Form.:
C32H34N2O6
Mol. Mass.:
542.6222
SMILES:
COc1ccc(Oc2ccccc2CN(CC[C@H](N)C(O)=O)Cc2ccccc2Oc2ccc(OC)cc2)cc1
: