Target
Neutral amino acid transporter B(0)
Ligand
BDBM50140081
Substrate
Meas. Tech.
ChEMBL_1547440 (CHEMBL3757559)
IC50
48300±n/a nM
Citation
 Schulte, MLKhodadadi, ABCuthbertson, MLSmith, JAManning, HC 2-Amino-4-bis(aryloxybenzyl)aminobutanoic acids: A novel scaffold for inhibition of ASCT2-mediated glutamine transport. Bioorg Med Chem Lett 26:1044-7 (2016)  
Target
Name:
Neutral amino acid transporter B(0)
Synonyms:
AAAT_HUMAN ASCT2 Baboon M7 virus receptor Neutral amino acid transporter B(0) RDR SLC1A5 Solute carrier family 1 member 5
Type:
PROTEIN
Mol. Mass.:
56592.12
Organism:
Homo sapiens (Human)
Description:
ChEMBL_109758
Residue:
541
  
Inhibitor
Name:
BDBM50140081
Synonyms:
CHEMBL3752103
Type:
Small organic molecule
Emp. Form.:
C30H32N4O4
Mol. Mass.:
512.5995
SMILES:
N[C@@H](CCN(Cc1ccccc1OCc1ccccn1)Cc1ccccc1OCc1ccccn1)C(O)=O
: