Target
Histone deacetylase 3
Ligand
BDBM50141111
Substrate
Meas. Tech.
ChEMBL_1551264 (CHEMBL3762115)
IC50
28±n/a nM
Citation
 Thaler, FMoretti, LAmici, RAbate, AColombo, ACarenzi, GFulco, MCBoggio, RDondio, GGagliardi, SMinucci, SSartori, LVarasi, MMercurio, C Synthesis, biological characterization and molecular modeling insights of spirochromanes as potent HDAC inhibitors. Eur J Med Chem 108:53-67 (2016)  
Target
Name:
Histone deacetylase 3
Synonyms:
HD3 HDAC3_HUMAN Human HDAC3 SMAP45
Type:
Enzyme
Mol. Mass.:
48829.55
Organism:
Homo sapiens (Human)
Description:
O15379
Residue:
428
  
Inhibitor
Name:
BDBM50141111
Synonyms:
CHEMBL3758901
Type:
Small organic molecule
Emp. Form.:
C22H22N2O4
Mol. Mass.:
378.4211
SMILES:
ONC(=O)\C=C\c1ccc2OC3(CCN(Cc4ccccc4)C3)CC(=O)c2c1
: