Target
Alpha-1A adrenergic receptor
Ligand
BDBM50142786
Substrate
Meas. Tech.
ChEMBL_1552598 (CHEMBL3762403)
Ki
230±n/a nM
Citation
 Capet, MCalmels, TLevoin, NDanvy, DBerrebi-Bertrand, IStark, HSchwartz, JCLecomte, JM Improving selectivity of dopamine D3 receptor ligands. Bioorg Med Chem Lett 26:885-8 (2016)  
Target
Name:
Alpha-1A adrenergic receptor
Synonyms:
ADA1A_HUMAN ADRA1C Alpha 1A-adrenoceptor Alpha adrenergic receptor 1a Alpha-adrenergic receptor 1c adrenergic Alpha1 | adrenergic Alpha1C
Type:
Cell-surface receptors
Mol. Mass.:
51511.67
Organism:
Homo sapiens (Human)
Description:
P35348
Residue:
466
  
Inhibitor
Name:
BDBM50142786
Synonyms:
CHEMBL3758741
Type:
Small organic molecule
Emp. Form.:
C27H33N3O
Mol. Mass.:
415.5704
SMILES:
Cc1cccc(N2CCN(CCCCNC(=O)c3ccc4ccccc4c3)CC2)c1C
: