Target
Melatonin receptor type 1B
Ligand
BDBM50035179
Substrate
Meas. Tech.
ChEMBL_1551496 (CHEMBL3762917)
EC50
0.180000±n/a nM
Citation
 Landagaray, EEttaoussi, MDuroux, RBoutin, JACaignard, DHDelagrange, PMelnyk, PBerthelot, PYous, S Melatonergic ligands: Design, synthesis and pharmacological evaluation of novel series of naphthofuranic derivatives. Eur J Med Chem 109:360-70 (2016)  
Target
Name:
Melatonin receptor type 1B
Synonyms:
MTNR1B Mel-1B-R Melatonin 1B Melatonin receptor type 1B | Melatonin receptor type 2 (MT2)
Type:
Enzyme
Mol. Mass.:
40203.54
Organism:
Homo sapiens (Human)
Description:
P49286
Residue:
362
  
Inhibitor
Name:
BDBM50035179
Synonyms:
Agomelatine N-[2-(7-Methoxy-naphthalen-1-yl)-ethyl]-acetamide S 20098 US11091445, Compound code IA2-76
Type:
Small organic molecule
Emp. Form.:
C15H17NO2
Mol. Mass.:
243.301
SMILES:
COc1ccc2cccc(CCNC(C)=O)c2c1
: