Target
Peroxisome proliferator-activated receptor gamma
Ligand
BDBM50144795
Substrate
Meas. Tech.
ChEMBL_1555243 (CHEMBL3768769)
EC50
4800±n/a nM
Citation
 Blöcher, RLamers, CWittmann, SKMerk, DHartmann, MWeizel, LDiehl, OBrüggerhoff, ABoß, MKaiser, ASchader, TGöbel, TGrundmann, MAngioni, CHeering, JGeisslinger, GWurglics, MKostenis, EBrüne, BSteinhilber, DSchubert-Zsilavecz, MKahnt, ASProschak, E N-Benzylbenzamides: A Novel Merged Scaffold for Orally Available Dual Soluble Epoxide Hydrolase/Peroxisome Proliferator-Activated Receptor¿ Modulators. J Med Chem 59:61-81 (2016)  
Target
Name:
Peroxisome proliferator-activated receptor gamma
Synonyms:
NR1C3 PPAR-gamma PPARG_HUMAN Peroxisome proliferator-activated receptor gamma (PPAR gamma) Peroxisome proliferator-activated receptor gamma (PPARγ) peroxisome proliferator-activated receptor gamma isoform 2
Type:
Nuclear Receptor
Mol. Mass.:
57613.46
Organism:
Homo sapiens (Human)
Description:
P37231
Residue:
505
  
Inhibitor
Name:
BDBM50144795
Synonyms:
CHEMBL3765141
Type:
Small organic molecule
Emp. Form.:
C20H20F3NO3
Mol. Mass.:
379.3729
SMILES:
CCC(Cc1ccc(cc1)C(=O)NCc1ccccc1C(F)(F)F)C(O)=O
: