Target
Bifunctional epoxide hydrolase 2
Ligand
BDBM50144895
Substrate
Meas. Tech.
ChEMBL_1555240 (CHEMBL3768766)
IC50
5000±n/a nM
Citation
 Blöcher, RLamers, CWittmann, SKMerk, DHartmann, MWeizel, LDiehl, OBrüggerhoff, ABoß, MKaiser, ASchader, TGöbel, TGrundmann, MAngioni, CHeering, JGeisslinger, GWurglics, MKostenis, EBrüne, BSteinhilber, DSchubert-Zsilavecz, MKahnt, ASProschak, E N-Benzylbenzamides: A Novel Merged Scaffold for Orally Available Dual Soluble Epoxide Hydrolase/Peroxisome Proliferator-Activated Receptor¿ Modulators. J Med Chem 59:61-81 (2016)  
Target
Name:
Bifunctional epoxide hydrolase 2
Synonyms:
Cytosolic epoxide hydrolase 2 EPHX2 HYES_HUMAN Soluble epoxide hydrolase (sEH) | epoxide hydrolase 2, cytoplasmic
Type:
Enzyme
Mol. Mass.:
62613.07
Organism:
Homo sapiens (Human)
Description:
P34913
Residue:
555
  
Inhibitor
Name:
BDBM50144895
Synonyms:
CHEMBL3764333
Type:
Small organic molecule
Emp. Form.:
C16H12F3N5O
Mol. Mass.:
347.2946
SMILES:
FC(F)(F)c1ccccc1CNC(=O)c1ccc(cc1)-c1nnn[nH]1
: