Target
Bifunctional epoxide hydrolase 2
Ligand
BDBM50144798
Substrate
Meas. Tech.
ChEMBL_1555240 (CHEMBL3768766)
IC50
250±n/a nM
Citation
 Blöcher, RLamers, CWittmann, SKMerk, DHartmann, MWeizel, LDiehl, OBrüggerhoff, ABoß, MKaiser, ASchader, TGöbel, TGrundmann, MAngioni, CHeering, JGeisslinger, GWurglics, MKostenis, EBrüne, BSteinhilber, DSchubert-Zsilavecz, MKahnt, ASProschak, E N-Benzylbenzamides: A Novel Merged Scaffold for Orally Available Dual Soluble Epoxide Hydrolase/Peroxisome Proliferator-Activated Receptor¿ Modulators. J Med Chem 59:61-81 (2016)  
Target
Name:
Bifunctional epoxide hydrolase 2
Synonyms:
Cytosolic epoxide hydrolase 2 EPHX2 HYES_HUMAN Soluble epoxide hydrolase (sEH) | epoxide hydrolase 2, cytoplasmic
Type:
Enzyme
Mol. Mass.:
62613.07
Organism:
Homo sapiens (Human)
Description:
P34913
Residue:
555
  
Inhibitor
Name:
BDBM50144798
Synonyms:
CHEMBL3764424
Type:
Small organic molecule
Emp. Form.:
C21H22F3NO3
Mol. Mass.:
393.3995
SMILES:
CCOC(=O)C(C)Cc1ccc(cc1)C(=O)NCc1ccccc1C(F)(F)F
: