Target
Serine-protein kinase ATM
Ligand
BDBM50144989
Substrate
Meas. Tech.
ChEMBL_1556115 (CHEMBL3768359)
IC50
10100±n/a nM
Citation
 Min, JGuo, KSuryadevara, PKZhu, FHolbrook, GChen, YFeau, CYoung, BMLemoff, AConnelly, MCKastan, MBGuy, RK Optimization of a Novel Series of Ataxia-Telangiectasia Mutated Kinase Inhibitors as Potential Radiosensitizing Agents. J Med Chem 59:559-77 (2016)  
Target
Name:
Serine-protein kinase ATM
Synonyms:
A-T mutated ATM_HUMAN | Ataxia telangiectasia mutated
Type:
Protein
Mol. Mass.:
350696.72
Organism:
Homo sapiens (Human)
Description:
Q13315
Residue:
3056
  
Inhibitor
Name:
BDBM50144989
Synonyms:
CHEMBL3765484
Type:
Small organic molecule
Emp. Form.:
C18H17N7O2
Mol. Mass.:
363.3733
SMILES:
COc1cc2nc(C)nc(-n3nc(nc3N)-c3ccccn3)c2cc1OC
: