Target
5-hydroxytryptamine receptor 2A
Ligand
BDBM50145591
Substrate
Meas. Tech.
ChEMBL_1556023 (CHEMBL3767882)
Ki
0.009560±n/a nM
Citation
 Fiorino, FCiano, AMagli, ESeverino, BCorvino, APerissutti, EFrecentese, FDi Vaio, PIzzo, AACapasso, RMassarelli, PNencini, CRossi, IKedzierska, EOrzelska-Gòrka, JBielenica, ASantagada, VCaliendo, G Synthesis, in vitro and in vivo pharmacological evaluation of serotoninergic ligands containing an isonicotinic nucleus. Eur J Med Chem 110:133-50 (2016)  
Target
Name:
5-hydroxytryptamine receptor 2A
Synonyms:
5-HT-2A 5-HT2A 5-hydroxytryptamine receptor 2A (5HT2A) Htr2 Serotonin Receptor 2A
Type:
G Protein-Coupled Receptor (GPCR)
Mol. Mass.:
52852.05
Organism:
Rattus norvegicus (rat)
Description:
Rat cortex membranes 5-HT2A receptors.
Residue:
471
  
Inhibitor
Name:
BDBM50145591
Synonyms:
CHEMBL3765471
Type:
Small organic molecule
Emp. Form.:
C25H27ClF2N4O
Mol. Mass.:
472.958
SMILES:
Cl.Fc1ccc(cc1)C(N1CCN(CCNC(=O)c2ccncc2)CC1)c1ccc(F)cc1
: