Target
Bromodomain-containing protein 4
Ligand
BDBM50150069
Substrate
Meas. Tech.
ChEMBL_1561952 (CHEMBL3778788)
IC50
5000±n/a nM
Citation
 Raux, BVoitovich, YDerviaux, CLugari, ARebuffet, EMilhas, SPriet, SRoux, TTrinquet, EGuillemot, JCKnapp, SBrunel, JMFedorov, AYCollette, YRoche, PBetzi, SCombes, SMorelli, X Exploring Selective Inhibition of the First Bromodomain of the Human Bromodomain and Extra-terminal Domain (BET) Proteins. J Med Chem 59:1634-41 (2016)  
Target
Name:
Bromodomain-containing protein 4
Synonyms:
BRD4 Bromodomain-containing protein 4 (BRD4) Protein HUNK1
Type:
Protein
Mol. Mass.:
152264.84
Organism:
Homo sapiens (Human)
Description:
O60885
Residue:
1362
  
Inhibitor
Name:
BDBM50150069
Synonyms:
CHEMBL3774931
Type:
Small organic molecule
Emp. Form.:
C23H32N8O2S
Mol. Mass.:
484.618
SMILES:
CCCCc1c(C)nc2nc(SCc3nc4n(CCCC)c(=O)[nH]c(=O)c4n3CC)nn2c1C
: